Welcome! Log In Create A New Profile

Advanced

Nginx 0.8.38 + nginx_mod_h264_streaming-2.2.7 = error

May 24, 2010 11:59PM
Начиная с Nginx 0.8.38 при сборке с nginx_mod_h264_streaming-2.2.7 получаю следующее

[quote]
gcc -c -pipe -O -W -Wall -Wpointer-arith -Wno-unused-parameter -Wunused-function -Wunused-variable -Wunused-value -g -O2 -g -pipe -Wall -Wp,-D_FORTIFY_SOURCE=2 -fexceptions -fstack-protector --param=ssp-buffer-size=4 -m32 -march=i386 -mtune=generic -fasynchronous-unwind-tables -D_LARGEFILE_SOURCE -DBUILDING_NGINX -I src/core -I src/event -I src/event/modules -I src/os/unix -I objs -I src/http -I src/http/modules -I src/http/modules/perl -I src/mail \
-o objs/addon/src/ngx_http_h264_streaming_module.o \
/home/mock/BUILD_ROOT/BUILD/nginx-0.8.38/nginx_mod_h264_streaming-2.2.7/src/ngx_http_h264_streaming_module.c
In file included from /home/mock/BUILD_ROOT/BUILD/nginx-0.8.38/nginx_mod_h264_streaming-2.2.7/src/ngx_http_h264_streaming_module.c:2:
/home/mock/BUILD_ROOT/BUILD/nginx-0.8.38/nginx_mod_h264_streaming-2.2.7/src/ngx_http_streaming_module.c: In function 'ngx_streaming_handler':
/home/mock/BUILD_ROOT/BUILD/nginx-0.8.38/nginx_mod_h264_streaming-2.2.7/src/ngx_http_streaming_module.c:158: error: 'ngx_http_request_t' has no member named 'zero_in_uri'
/home/mock/BUILD_ROOT/BUILD/nginx-0.8.38/nginx_mod_h264_streaming-2.2.7/src/ngx_http_streaming_module.c: In function 'ngx_streaming':
/home/mock/BUILD_ROOT/BUILD/nginx-0.8.38/nginx_mod_h264_streaming-2.2.7/src/ngx_http_streaming_module.c:407: warning: unused parameter 'cmd'
/home/mock/BUILD_ROOT/BUILD/nginx-0.8.38/nginx_mod_h264_streaming-2.2.7/src/ngx_http_streaming_module.c:407: warning: unused parameter 'conf'
make[1]: *** [objs/addon/src/ngx_http_h264_streaming_module.o] Error 1
make[1]: Leaving directory `/home/mock/BUILD_ROOT/BUILD/nginx-0.8.38'
make: *** [build] Error 2

[/quote]

Как это можно полечить ?
Subject Author Posted

Nginx 0.8.38 + nginx_mod_h264_streaming-2.2.7 = error

INF[SZ] May 24, 2010 11:59PM

Re: Nginx 0.8.38 + nginx_mod_h264_streaming-2.2.7 = error

INF[SZ] May 25, 2010 06:26AM



Sorry, only registered users may post in this forum.

Click here to login

Online Users

Guests: 179
Record Number of Users: 6 on February 13, 2018
Record Number of Guests: 421 on December 02, 2018
Powered by nginx      Powered by FreeBSD      PHP Powered      Powered by MariaDB      ipv6 ready