Welcome! Log In Create A New Profile

Advanced

compiling errors - 0.7.59

Brandon Fisher
May 26, 2009 06:23AM
Hello , i got a dedi running fedora core 9
with the development tools bundle installed
and i just cant compile it all the way.

I had it downloaded then uncompressed,ran configure
then make but it couldnt compile it all the way.

Here are the errors

In file included from src/http/ngx_http_file_cache.c:10:
src/core/ngx_md5.h:18:17: error: md5.h: No such file or directory
In file included from src/http/ngx_http_file_cache.c:10:
src/core/ngx_md5.h:22: error: expected ג€˜=ג€™, ג€˜,ג€™, ג€˜;ג€™,
ג€˜asmג€™ or ג€˜__attribute__ג€™ before ג€˜ngx_md5_tג€™
src/http/ngx_http_file_cache.c: In function
ג€˜ngx_http_file_cache_create_keyג€™:
src/http/ngx_http_file_cache.c:120: error: ג€˜ngx_md5_tג€™ undeclared
(first use in this function)
src/http/ngx_http_file_cache.c:120: error: (Each undeclared identifier
is reported only once
src/http/ngx_http_file_cache.c:120: error: for each function it appears
in.)
src/http/ngx_http_file_cache.c:120: error: expected ג€˜;ג€™ before
ג€˜md5ג€™
cc1: warnings being treated as errors
src/http/ngx_http_file_cache.c:128: error: implicit declaration of
function ג€˜MD5Initג€™
src/http/ngx_http_file_cache.c:128: error: ג€˜md5ג€™ undeclared (first
use in this function)
src/http/ngx_http_file_cache.c:138: error: implicit declaration of
function ג€˜MD5Updateג€™
src/http/ngx_http_file_cache.c:145: error: implicit declaration of
function ג€˜MD5Finalג€™
make[1]: *** [objs/src/http/ngx_http_file_cache.o] Error 1
--
Posted via http://www.ruby-forum.com/.
Subject Author Posted

compiling errors - 0.7.59

Brandon Fisher May 26, 2009 06:23AM

Re: compiling errors - 0.7.59

Igor Sysoev May 26, 2009 06:27AM

Re: compiling errors - 0.7.59

Brandon Fisher May 26, 2009 06:43AM

Re: compiling errors - 0.7.59

Brandon Fisher May 26, 2009 06:53AM

Re: compiling errors - 0.7.59

Brandon Fisher May 26, 2009 07:14AM

Re: compiling errors - 0.7.59

Maxim Dounin May 26, 2009 08:13AM

Re: compiling errors - 0.7.59

Jim Ohlstein May 26, 2009 08:28AM

Re: compiling errors - 0.7.59

Igor Sysoev May 26, 2009 08:37AM

Re: compiling errors - 0.7.59

Jim Ohlstein May 26, 2009 08:27AM



Sorry, only registered users may post in this forum.

Click here to login

Online Users

Guests: 133
Record Number of Users: 6 on February 13, 2018
Record Number of Guests: 421 on December 02, 2018
Powered by nginx      Powered by FreeBSD      PHP Powered      Powered by MariaDB      ipv6 ready