Welcome! Log In Create A New Profile

Advanced

Re: SPDY compilation fail - Warnings

July 26, 2012 09:13AM
cc1: warnings being treated as errors
src/http/ngx_http_request.c: In function ‘ngx_http_ssl_handshake_handler’:
src/http/ngx_http_request.c:635: error: implicit declaration of function ‘SSL_get0_next_proto_negotiated’
make[1]: *** [objs/src/http/ngx_http_request.o] Erreur 1
make[1]: quittant le répertoire « /usr/local/src/nginx-1.3.2 »
make: *** [build] Erreur 2
Subject Author Posted

SPDY compilation fail - Warnings

DenisTRUFFAUT July 25, 2012 11:52PM

Re: SPDY compilation fail - Warnings

Valentin V. Bartenev July 26, 2012 05:26AM

Re: SPDY compilation fail - Warnings

DenisTRUFFAUT July 26, 2012 09:13AM

Re: SPDY compilation fail - Warnings

DenisTRUFFAUT July 26, 2012 09:21AM

Re: SPDY compilation fail - Warnings

DenisTRUFFAUT July 26, 2012 11:59AM

Re: SPDY compilation fail - Warnings

Valentin V. Bartenev July 26, 2012 09:58AM

Re: SPDY compilation fail - Warnings

DenisTRUFFAUT August 14, 2012 05:10PM

Re: SPDY compilation fail - Warnings

hexa August 14, 2012 05:16PM

Re: SPDY compilation fail - Warnings

DenisTRUFFAUT August 14, 2012 05:47PM

Re: SPDY compilation fail - Warnings

DenisTRUFFAUT August 14, 2012 06:08PM

Re: SPDY compilation fail - Warnings

VBart August 14, 2012 05:22PM

Re: SPDY compilation fail - Warnings

VBart August 14, 2012 05:32PM



Sorry, only registered users may post in this forum.

Click here to login

Online Users

Guests: 87
Record Number of Users: 6 on February 13, 2018
Record Number of Guests: 421 on December 02, 2018
Powered by nginx      Powered by FreeBSD      PHP Powered      Powered by MariaDB      ipv6 ready